BDBM50563033 CHEMBL4789911
SMILES CC[C@H](C)[C@H](NC(=O)[C@@H]1Cc2ccc(O)c(C\C=C\CNCCC[C@H](N)C(=O)N[C@@H](CCCCN)C(=O)N3CCC[C@H]3C(=O)N1)c2)C(=O)N[C@@H](CC(C)C)C(O)=O
InChI Key InChIKey=ZERHMVNHOAJQDO-BSFYRCLISA-N
Data  1 KI
  Tab Delimited (TSV)   2D SDfile   Computed 3D by Vconf -m prep SDfile
Find this compound or compounds like it in BindingDB:
Activity Spreadsheet -- Enzyme Inhibition Constant Data from BindingDB
Found 1 hit for monomerid = 50563033
TargetNeurotensin receptor type 2(Homo sapiens (Human))
Universit£
Curated by ChEMBL
LigandPNGBDBM50563033(CHEMBL4789911)
Affinity DataKi:  4.5nM. Assay description: Binding affinity to NTS2 (unknown origin)
Ligand InfoPC cidPC sid
In DepthDetails ArticlePubMed