BDBM50563863 CHEMBL4787498
SMILES CC#C[C@@H](CC(O)=O)c1ccc(OCc2ccc(CN3CCC4(CCc5ccccc45)CC3)s2)cc1
InChI Key InChIKey=LGIUHWQDGPFXSG-VWLOTQADSA-N
Data  1 KI  1 IC50  1 Kd  8 EC50
  Tab Delimited (TSV)   2D SDfile   Computed 3D by Vconf -m prep SDfile
Find this compound or compounds like it in BindingDB:
Activity Spreadsheet -- Enzyme Inhibition Constant Data from BindingDB
Found 11 hits for monomerid = 50563863
TargetFree fatty acid receptor 1(Homo sapiens (Human))
Lilly Research Laboratories
Curated by ChEMBL
LigandPNGBDBM50563863(CHEMBL4787498)
Affinity DataKi:  8.20nM. Assay description: Displacement of [3H]-TAK-875 from human recombinant full-length GPR40 expressed in human HEK293 cell membrane incubated for 2 hrs by solid scintillat...
Ligand InfoPC cidPC sid
In DepthDetails ArticlePubMed
TargetFree fatty acid receptor 1(Homo sapiens (Human))
Lilly Research Laboratories
Curated by ChEMBL
LigandPNGBDBM50563863(CHEMBL4787498)
Affinity DataEC50:  7.90nM. Assay description: Agonist activity at human recombinant full-length Prolink-tagged GPR40 fused with EA-tagged beta-arrestin expressed in human HEK293 cells assessed as...
Ligand InfoPC cidPC sid
In DepthDetails ArticlePubMed
TargetFree fatty acid receptor 1(Mus musculus)
Lilly Research Laboratories
Curated by ChEMBL
LigandPNGBDBM50563863(CHEMBL4787498)
Affinity DataEC50:  1.20nM. Assay description: Agonist activity at Prolink-tagged mouse GPR40 fused with EA-tagged beta-arrestin expressed in human U2OS cells assessed as induction of beta-arresti...
Ligand InfoPC cidPC sid
In DepthDetails ArticlePubMed
TargetMelanocortin receptor 4(Rattus norvegicus)
Lilly Research Laboratories
Curated by ChEMBL
LigandPNGBDBM50563863(CHEMBL4787498)
Affinity DataEC50:  1.70nM. Assay description: Agonist activity at Prolink-tagged rat GPR40 fused with EA-tagged beta-arrestin expressed in human U2OS cells assessed as induction of beta-arrestin ...
Ligand InfoPC cidPC sid
In DepthDetails ArticlePubMed
TargetPeroxisome proliferator-activated receptor gamma/Retinoic acid receptor RXR-alpha(Homo sapiens (Human))
Lilly Research Laboratories
Curated by ChEMBL
LigandPNGBDBM50563863(CHEMBL4787498)
Affinity DataEC50: >1.00E+4nM. Assay description: Agonist activity at human CMV-fused PPARgamma LBD/RXRalpha (unknown origin) expressed in African green monkey CV1 cells transfected with luciferase p...
Ligand InfoPC cidPC sid
In DepthDetails ArticlePubMed
TargetFree fatty acid receptor 1(Homo sapiens (Human))
Lilly Research Laboratories
Curated by ChEMBL
LigandPNGBDBM50563863(CHEMBL4787498)
Affinity DataKd:  3.5nM. Assay description: Displacement of [3H]-(S)-2-(6-((2',6'-dimethyl-4'-(3-(methylsulfonyl)propoxy)biphenyl-3-yl)methoxy)-2,3-dihydrobenzofuran-3-yl)acetic acid from human...
Ligand InfoPC cidPC sid
In DepthDetails ArticlePubMed
TargetPotassium voltage-gated channel subfamily H member 2(Homo sapiens (Human))
Lilly Research Laboratories
Curated by ChEMBL
LigandPNGBDBM50563863(CHEMBL4787498)
Affinity DataIC50: >1.00E+4nM. Assay description: Inhibition of human ERG
Ligand InfoPC cidPC sid
In DepthDetails ArticlePubMed
TargetPeroxisome proliferator-activated receptor alpha(Homo sapiens (Human))
Lilly Research Laboratories
Curated by ChEMBL
LigandPNGBDBM50563863(CHEMBL4787498)
Affinity DataEC50: >1.00E+4nM. Assay description: Agonist activity at human Gal4-fused PPARalpha LBD expressed in African green monkey CV1 cells cotransfected with pRL-SV40 plasmid measured after 24 ...
Ligand InfoPC cidPC sid
In DepthDetails ArticlePubMed
TargetPeroxisome proliferator-activated receptor delta(Homo sapiens (Human))
Lilly Research Laboratories
Curated by ChEMBL
LigandPNGBDBM50563863(CHEMBL4787498)
Affinity DataEC50: >1.00E+4nM. Assay description: Agonist activity at human Gal4-fused PPARdelta LBD expressed in African green monkey CV1 cells cotransfected with pRL-SV40 plasmid measured after 24 ...
Ligand InfoPC cidPC sid
In DepthDetails ArticlePubMed
TargetFree fatty acid receptor 1(Homo sapiens (Human))
Lilly Research Laboratories
Curated by ChEMBL
LigandPNGBDBM50563863(CHEMBL4787498)
Affinity DataEC50:  8nM. Assay description: Agonist activity at human recombinant full length GPR40 overexpressed in human HEK293 cells assessed as increase in intracellular calcium level measu...
Ligand InfoPC cidPC sid
In DepthDetails ArticlePubMed
TargetFree fatty acid receptor 1(Homo sapiens (Human))
Lilly Research Laboratories
Curated by ChEMBL
LigandPNGBDBM50563863(CHEMBL4787498)
Affinity DataEC50:  6.10nM. Assay description: Agonist activity at human recombinant full length GPR40 overexpressed in human HEK293 cells assessed as increase in inositol phosphate accumulation i...
Ligand InfoPC cidPC sid
In DepthDetails ArticlePubMed