BDBM50564144 CHEMBL4795611
SMILES Cc1ccc(CCC2CCc3nc(N)nc(N)c3N2C(=O)CBr)cc1
InChI Key InChIKey=VAJZRALOMAYDBC-UHFFFAOYSA-N
Data  1 IC50
  Tab Delimited (TSV)   2D SDfile   Computed 3D by Vconf -m prep SDfile
Find this compound or compounds like it in BindingDB:
Activity Spreadsheet -- Enzyme Inhibition Constant Data from BindingDB
Found 1 hit for monomerid = 50564144
TargetMethionine synthase(Homo sapiens (Human))
Peking University
Curated by ChEMBL
LigandPNGBDBM50564144(CHEMBL4795611)
Affinity DataIC50:  4.80E+4nM. Assay description: Inhibition of human Cobalamin-dependent methionine synthase isolated from HL-60 cells using methyltetrahydrofolate as substrate incubated for 10 mins...
Ligand InfoPC cidPC sid
In DepthDetails ArticlePubMed