BDBM50564147 CHEMBL4776344
SMILES CC(C)(C)c1ccc(CCC2CCc3nc(N)nc(N)c3N2C(=O)CCl)cc1
InChI Key InChIKey=YEHBQHGYKVRZGN-UHFFFAOYSA-N
Data  1 IC50
  Tab Delimited (TSV)   2D SDfile   Computed 3D by Vconf -m prep SDfile
Find this compound or compounds like it in BindingDB:
Activity Spreadsheet -- Enzyme Inhibition Constant Data from BindingDB
Found 1 hit for monomerid = 50564147
TargetMethionine synthase(Homo sapiens (Human))
Peking University
Curated by ChEMBL
LigandPNGBDBM50564147(CHEMBL4776344)
Affinity DataIC50:  1.35E+4nM. Assay description: Inhibition of human Cobalamin-dependent methionine synthase isolated from HL-60 cells using methyltetrahydrofolate as substrate incubated for 10 mins...
Ligand InfoPC cidPC sid
In DepthDetails ArticlePubMed