BDBM50564820 CHEMBL4785212
SMILES CCC(=O)c1c(N2CCOCC2)c2ccc(Nc3ncc(F)c(n3)-c3ccc(F)cc3OC)cc2oc1=O
InChI Key InChIKey=HDSMDAXOECRDBG-UHFFFAOYSA-N
Data  2 IC50
  Tab Delimited (TSV)   2D SDfile   Computed 3D by Vconf -m prep SDfile
Find this compound or compounds like it in BindingDB:
Activity Spreadsheet -- Enzyme Inhibition Constant Data from BindingDB
Found 2 hits for monomerid = 50564820
TargetCyclin-A2/Cyclin-dependent kinase 2(Homo sapiens (Human))
China Pharmaceutical University
Curated by ChEMBL
LigandPNGBDBM50564820(CHEMBL4785212)
Affinity DataIC50:  338nM. Assay description: Inhibition of CDK2/Cyclin A (unknown origin) preincubated for 20 mins followed by ATP addition and measured after 120 mins in presence of [33P-gamma]...
Ligand InfoPC cidPC sid
In DepthDetails ArticlePubMed
TargetCyclin-T1/Cyclin-dependent kinase 9(Homo sapiens (Human))
China Pharmaceutical University
Curated by ChEMBL
LigandPNGBDBM50564820(CHEMBL4785212)
Affinity DataIC50:  0.700nM. Assay description: Inhibition of CDK9/Cyclin T1 (unknown origin) preincubated for 20 mins followed by ATP addition and measured after 120 mins in presence of [33P-gamma...
Ligand InfoPC cidPC sid
In DepthDetails ArticlePubMed