BDBM50565105 CHEMBL4792974
SMILES FC(F)(F)c1cc(NC(=O)Nc2ccc3N(c4ccncc4)C(=O)c4cccnc4Oc3c2)ccc1Cl
InChI Key InChIKey=NQHGDUGVQSAKOR-UHFFFAOYSA-N
Data  7 IC50
PDB links: 1 PDB ID matches this monomer.
  Tab Delimited (TSV)   2D SDfile   Computed 3D by Vconf -m prep SDfile
Find this compound or compounds like it in BindingDB:
Activity Spreadsheet -- Enzyme Inhibition Constant Data from BindingDB
Found 7 hits for monomerid = 50565105
TargetCyclin-dependent kinase 8(Homo sapiens (Human))
Spanish National Cancer Research Centre (Cnio)
Curated by ChEMBL
LigandPNGBDBM50565105(CHEMBL4792974)
Affinity DataIC50:  1.30E+3nM. Assay description: Inhibition of CDK8 in human SW-620 cells assessed as reduction in STAT1 phosphorylation at Ser727 residues measured after 8 hrs
TargetCyclin-dependent kinase 8(Homo sapiens (Human))
Spanish National Cancer Research Centre (Cnio)
Curated by ChEMBL
LigandPNGBDBM50565105(CHEMBL4792974)
Affinity DataIC50:  8.30nM. Assay description: Inhibition of CDK8 (unknown origin)
TargetCyclin-dependent kinase 19(Homo sapiens (Human))
Spanish National Cancer Research Centre (Cnio)
Curated by ChEMBL
LigandPNGBDBM50565105(CHEMBL4792974)
Affinity DataIC50:  29nM. Assay description: Inhibition of CDK19 (unknown origin)
TargetEpithelial discoidin domain-containing receptor 1(Homo sapiens (Human))
Spanish National Cancer Research Centre (Cnio)
Curated by ChEMBL
LigandPNGBDBM50565105(CHEMBL4792974)
Affinity DataIC50:  170nM. Assay description: Inhibition of DDR1 (unknown origin) expressed in HEK293T cells assessed as reduction in collagen-induced DDR1 autophosphorylation
In DepthDetails ArticlePubMed
TargetDual specificity protein kinase CLK4(Homo sapiens (Human))
Spanish National Cancer Research Centre (Cnio)
Curated by ChEMBL
LigandPNGBDBM50565105(CHEMBL4792974)
Affinity DataIC50: >1.00E+4nM. Assay description: Inhibition of CLK4 (unknown origin)
In DepthDetails ArticlePubMed
TargetEpithelial discoidin domain-containing receptor 1(Homo sapiens (Human))
Spanish National Cancer Research Centre (Cnio)
Curated by ChEMBL
LigandPNGBDBM50565105(CHEMBL4792974)
Affinity DataIC50:  180nM. Assay description: Inhibition of DDR1 (unknown origin)
In DepthDetails ArticlePubMed
TargetCyclin-dependent kinase 7(Homo sapiens (Human))
Spanish National Cancer Research Centre (Cnio)
Curated by ChEMBL
LigandPNGBDBM50565105(CHEMBL4792974)
Affinity DataIC50: >1.00E+4nM. Assay description: Inhibition of CDK7 (unknown origin)
In DepthDetails ArticlePubMed