BDBM50565475 CHEMBL4777401
SMILES CC[C@H](C)[C@H](NC(=O)[C@H](CCCNC(N)=N)NC(C)=O)C(=O)N[C@@H]([C@@H](C)CC)C(=O)N[C@@H](Cc1ccc(O)cc1)C(=O)N[C@@H](CC(O)=O)C(=O)N[C@@H](CCCNC(N)=N)C(=O)N[C@H]1CCCCNC(=O)CC[C@H](NC(=O)[C@H](CCSC)NC(=O)[C@H](CC(C)C)NC(=O)[C@H](Cc2ccccc2)NC1=O)C(=O)N[C@@H](CS)C(=O)N[C@@H](CCCNC(N)=N)C(N)=O
InChI Key InChIKey=HBSYOUCAUKPLME-AFUKFTIKSA-N
Data  1 IC50  1 Kd  1 Koff
  Tab Delimited (TSV)   2D SDfile   Computed 3D by Vconf -m prep SDfile
Find this compound or compounds like it in BindingDB:
Activity Spreadsheet -- Enzyme Inhibition Constant Data from BindingDB
Found 3 hits for monomerid = 50565475
TargetEukaryotic translation initiation factor 4E(Homo sapiens (Human))
University Of Michigan
Curated by ChEMBL
LigandPNGBDBM50565475(CHEMBL4777401)
Affinity DataIC50:  22nM. Assay description: Inhibition of recombinant human 10His-tagged eIF4E expressed in Escherichia coli BL21 (DE3) cells by catalytic enzyme-linked click chemistry assay
Ligand InfoKEGGPC cidPC sid
In DepthDetails ArticlePubMed
TargetEukaryotic translation initiation factor 4E(Homo sapiens (Human))
University Of Michigan
Curated by ChEMBL
LigandPNGBDBM50565475(CHEMBL4777401)
Affinity DataKd:  7.20nM. Assay description: Binding affinity to recombinant human 10His-tagged eIF4E expressed in Escherichia coli BL21 (DE3) cells assessed as binding constant by surface plasm...
Ligand InfoKEGGPC cidPC sid
In DepthDetails ArticlePubMed
TargetEukaryotic translation initiation factor 4E(Homo sapiens (Human))
University Of Michigan
Curated by ChEMBL
LigandPNGBDBM50565475(CHEMBL4777401)
Affinity DataKon:  0.00420M-1s-1Assay Description:Binding affinity to recombinant human 10His-tagged eIF4E expressed in Escherichia coli BL21 (DE3) cells assessed as dissociation constant by surface ...
Ligand InfoKEGGPC cidPC sid
In DepthDetails ArticlePubMed