BDBM50568148 CHEMBL4859278
SMILES COc1ccccc1-c1nnc(SCC(=O)Nc2ccc(Br)cc2)o1
InChI Key InChIKey=VLCXHHDFHWGHDP-UHFFFAOYSA-N
Data  1 IC50
  Tab Delimited (TSV)   2D SDfile   Computed 3D by Vconf -m prep SDfile
Find this compound or compounds like it in BindingDB:
Activity Spreadsheet -- Enzyme Inhibition Constant Data from BindingDB
Found 1 hit for monomerid = 50568148
TargetPolyphenol oxidase 2(Agaricus bisporus (Common mushroom))
Kongju National University
Curated by ChEMBL
LigandPNGBDBM50568148(CHEMBL4859278)
Affinity DataIC50:  46nM. Assay description: Inhibition of mushroom tyrosinase using L-DOPA as substrate
Ligand InfoPC cidPC sid
In DepthDetails ArticlePubMed