BDBM50568151 CHEMBL4849416
SMILES COc1cccc(c1)-c1nnc(SCC(=O)Nc2ccc(F)cc2)o1
InChI Key InChIKey=OWEIVLJCTKVRRM-UHFFFAOYSA-N
Data  1 IC50
  Tab Delimited (TSV)   2D SDfile   Computed 3D by Vconf -m prep SDfile
Find this compound or compounds like it in BindingDB:
Activity Spreadsheet -- Enzyme Inhibition Constant Data from BindingDB
Found 1 hit for monomerid = 50568151
TargetPolyphenol oxidase 2(Agaricus bisporus (Common mushroom))
Kongju National University
Curated by ChEMBL
LigandPNGBDBM50568151(CHEMBL4849416)
Affinity DataIC50:  27nM. Assay description: Inhibition of mushroom tyrosinase using L-DOPA as substrate
Ligand InfoPC cidPC sid
In DepthDetails ArticlePubMed