BDBM50568221 CHEMBL4854947
SMILES CNC(=O)[C@@H](Cc1ccc(cc1)C#N)NC(=O)[C@@H](NC(=O)[C@]1(C)CO1)[C@@H](C)OC(C)(C)C
InChI Key InChIKey=LRXNJCCPNMMAJW-SWDAYOAKSA-N
Data  1 KI  2 IC50
  Tab Delimited (TSV)   2D SDfile   Computed 3D by Vconf -m prep SDfile
Find this compound or compounds like it in BindingDB:
Activity Spreadsheet -- Enzyme Inhibition Constant Data from BindingDB
Found 3 hits for monomerid = 50568221
TargetTyrosine-protein kinase BTK(Homo sapiens (Human))
X-Chem
Curated by ChEMBL
LigandPNGBDBM50568221(CHEMBL4854947)
Affinity DataKi:  1.25E+3nM. Assay description: Inhibition of recombinant human N-terminal His-tagged BTK expressed in baculovirus infected in Sf9 cells assessed as inhibitory constant incubated fo...
In DepthDetails ArticlePubMed
TargetTyrosine-protein kinase BTK(Homo sapiens (Human))
X-Chem
Curated by ChEMBL
LigandPNGBDBM50568221(CHEMBL4854947)
Affinity DataIC50: >5.92E+3nM. Assay description: Inhibition of recombinant human N-terminal His-tagged BTK C481S mutant expressed in baculovirus infected in Sf9 cells incubated for 1 hr by TR-FRET a...
In DepthDetails ArticlePubMed
TargetTyrosine-protein kinase BTK(Homo sapiens (Human))
X-Chem
Curated by ChEMBL
LigandPNGBDBM50568221(CHEMBL4854947)
Affinity DataIC50:  58nM. Assay description: Inhibition of recombinant human N-terminal His-tagged BTK expressed in baculovirus infected in Sf9 cells incubated for 1 hr by TR-FRET assay
In DepthDetails ArticlePubMed