BDBM50568238 CHEMBL4847408
SMILES COc1cc(ccc1OCC(=O)NCc1ccco1)-c1cc(C(O)=O)c2ccccc2n1
InChI Key InChIKey=MXJKFBVDXOPXFJ-UHFFFAOYSA-N
Data  1 IC50
  Tab Delimited (TSV)   2D SDfile   Computed 3D by Vconf -m prep SDfile
Find this compound or compounds like it in BindingDB:
Activity Spreadsheet -- Enzyme Inhibition Constant Data from BindingDB
Found 1 hit for monomerid = 50568238
TargetDihydroorotate dehydrogenase (quinone), mitochondrial(Homo sapiens (Human))
University Of Kragujevac
Curated by ChEMBL
LigandPNGBDBM50568238(CHEMBL4847408)
Affinity DataIC50:  1.00E+3nM. Assay description: Inhibition of human DHODH
Ligand InfoPC cidPC sid
In DepthDetails ArticlePubMed