BDBM50568858 CHEMBL4856113
SMILES OC(=O)C(F)(F)F.OC(=O)C(F)(F)F.OC(=O)C(F)(F)F.OC(=O)C(F)(F)F.OC(=O)C(F)(F)F.C[C@H](NC(=O)[C@H](CCNC(N)=N)NCCN1CCN(CCCCC2CCN(CC(=O)N3c4ccccc4NC(=O)c4ccccc34)CC2)CC1)C(=O)NC(=O)[C@H](CCCN)NC(C)=O
InChI Key InChIKey=KDPDHZVRHMRFQH-OUOHYALTSA-N
Data  3 KI
  Tab Delimited (TSV)   2D SDfile   Computed 3D by Vconf -m prep SDfile
Find this compound or compounds like it in BindingDB:
Activity Spreadsheet -- Enzyme Inhibition Constant Data from BindingDB
Found 3 hits for monomerid = 50568858
TargetMuscarinic acetylcholine receptor M2(Homo sapiens (Human))
University Of Regensburg
Curated by ChEMBL
LigandPNGBDBM50568858(CHEMBL4856113)
Affinity DataKi:  0.0794nM. Assay description: Displacement of [3H]-NMS from human muscarinic M2 receptor expressed in CHO cell membranes assessed as inhibition constant by radioligand competition...
Ligand InfoPC cidPC sid
In DepthDetails ArticlePubMed
TargetMuscarinic acetylcholine receptor M1(Homo sapiens (Human))
University Of Regensburg
Curated by ChEMBL
LigandPNGBDBM50568858(CHEMBL4856113)
Affinity DataKi:  1.30nM. Assay description: Displacement of [3H]-NMS from human muscarinic M1 receptor expressed in CHO cell membranes assessed as inhibition constant by radioligand competition...
Ligand InfoPC cidPC sid
In DepthDetails ArticlePubMed
TargetMuscarinic acetylcholine receptor M4(Homo sapiens (Human))
University Of Regensburg
Curated by ChEMBL
LigandPNGBDBM50568858(CHEMBL4856113)
Affinity DataKi:  3.30nM. Assay description: Displacement of [3H]-NMS from human muscarinic M4 receptor expressed in CHO cell membranes assessed as inhibition constant by radioligand competition...
Ligand InfoPC cidPC sid
In DepthDetails ArticlePubMed