BDBM50568907 CHEMBL4859988
SMILES CC(=O)Nc1ccc(CCCCN2CCN(CC2)c2ccccn2)cc1
InChI Key InChIKey=KQZXADGECOXBKU-UHFFFAOYSA-N
Data  14 KI
  Tab Delimited (TSV)   2D SDfile   Computed 3D by Vconf -m prep SDfile
Find this compound or compounds like it in BindingDB:
Activity Spreadsheet -- Enzyme Inhibition Constant Data from BindingDB
Found 14 hits for monomerid = 50568907
Target5-hydroxytryptamine receptor 1A(Homo sapiens (Human))
Florida A&M University
Curated by ChEMBL
LigandPNGBDBM50568907(CHEMBL4859988)
Affinity DataKi:  14nM. Assay description: Displacement of [3H]-8-OH-DPAT from human 5-HT1A receptor incubated for 1 hr by liquid scintillation counting method
Ligand InfoPC cidPC sid
In DepthDetails ArticlePubMed
Target5-hydroxytryptamine receptor 1A(Homo sapiens (Human))
Florida A&M University
Curated by ChEMBL
LigandPNGBDBM50568907(CHEMBL4859988)
Affinity DataKi:  14nM. Assay description: Displacement of [3H]-8-OH-DPAT from human 5-HT1A receptor incubated for 1 hr by liquid scintillation counting method
Ligand InfoPC cidPC sid
In DepthDetails ArticlePubMed
Target5-hydroxytryptamine receptor 7(Homo sapiens (Human))
Florida A&M University
Curated by ChEMBL
LigandPNGBDBM50568907(CHEMBL4859988)
Affinity DataKi:  134nM. Assay description: Displacement of [3H]-LSD from human 5-HT7 receptor incubated for 1 hr by liquid scintillation counting method
Ligand InfoPC cidPC sid
In DepthDetails ArticlePubMed
Target5-hydroxytryptamine receptor 7(Homo sapiens (Human))
Florida A&M University
Curated by ChEMBL
LigandPNGBDBM50568907(CHEMBL4859988)
Affinity DataKi:  135nM. Assay description: Displacement of [3H]-LSD from human 5-HT7 receptor incubated for 1 hr by liquid scintillation counting method
Ligand InfoPC cidPC sid
In DepthDetails ArticlePubMed
TargetD(3) dopamine receptor(Homo sapiens)
Florida A&M University
Curated by ChEMBL
LigandPNGBDBM50568907(CHEMBL4859988)
Affinity DataKi:  203nM. Assay description: Displacement of [3H]N-methylspiperone from human dopamine D3 receptor incubated for 1 hr by liquid scintillation counting method
Ligand InfoPC cidPC sid
In DepthDetails ArticlePubMed
TargetD(3) dopamine receptor(Homo sapiens)
Florida A&M University
Curated by ChEMBL
LigandPNGBDBM50568907(CHEMBL4859988)
Affinity DataKi:  204nM. Assay description: Displacement of [3H]N-methylspiperone from human dopamine D3 receptor incubated for 1 hr by liquid scintillation counting method
Ligand InfoPC cidPC sid
In DepthDetails ArticlePubMed
Target5-hydroxytryptamine receptor 2C(Homo sapiens)
Florida A&M University
Curated by ChEMBL
LigandPNGBDBM50568907(CHEMBL4859988)
Affinity DataKi:  240nM. Assay description: Displacement of [3H]-Mesulergine from human 5-HT2C receptor incubated for 1 hr by liquid scintillation counting method
Ligand InfoPC cidPC sid
In DepthDetails ArticlePubMed
Target5-hydroxytryptamine receptor 2C(Homo sapiens)
Florida A&M University
Curated by ChEMBL
LigandPNGBDBM50568907(CHEMBL4859988)
Affinity DataKi:  242nM. Assay description: Displacement of [3H]-Mesulergine from human 5-HT2C receptor incubated for 1 hr by liquid scintillation counting method
Ligand InfoPC cidPC sid
In DepthDetails ArticlePubMed
Target5-hydroxytryptamine receptor 2A(Homo sapiens (Human))
Florida A&M University
Curated by ChEMBL
LigandPNGBDBM50568907(CHEMBL4859988)
Affinity DataKi:  355nM. Assay description: Displacement of [3H]-Ketanserin from human 5-HT2A receptor incubated for 1 hr by liquid scintillation counting method
Ligand InfoPC cidPC sid
In DepthDetails ArticlePubMed
Target5-hydroxytryptamine receptor 2A(Homo sapiens (Human))
Florida A&M University
Curated by ChEMBL
LigandPNGBDBM50568907(CHEMBL4859988)
Affinity DataKi:  385nM. Assay description: Displacement of [3H]-Ketanserin from human 5-HT2A receptor incubated for 1 hr by liquid scintillation counting method
Ligand InfoPC cidPC sid
In DepthDetails ArticlePubMed
TargetD(2) dopamine receptor(Homo sapiens (Human))
Florida A&M University
Curated by ChEMBL
LigandPNGBDBM50568907(CHEMBL4859988)
Affinity DataKi:  1.93E+3nM. Assay description: Displacement of [3H]N-methylspiperone from human dopamine D2 receptor incubated for 1 hr by liquid scintillation counting method
Ligand InfoPC cidPC sid
In DepthDetails ArticlePubMed
TargetD(2) dopamine receptor(Homo sapiens (Human))
Florida A&M University
Curated by ChEMBL
LigandPNGBDBM50568907(CHEMBL4859988)
Affinity DataKi:  1.95E+3nM. Assay description: Displacement of [3H]N-methylspiperone from human dopamine D2 receptor incubated for 1 hr by liquid scintillation counting method
Ligand InfoPC cidPC sid
In DepthDetails ArticlePubMed
TargetD(4) dopamine receptor(Homo sapiens (Human))
Florida A&M University
Curated by ChEMBL
LigandPNGBDBM50568907(CHEMBL4859988)
Affinity DataKi: <1.00E+4nM. Assay description: Displacement of [3H]N-methylspiperone from human dopamine D4 receptor incubated for 1 hr by liquid scintillation counting method
Ligand InfoPC cidPC sid
In DepthDetails ArticlePubMed
TargetD(4) dopamine receptor(Homo sapiens (Human))
Florida A&M University
Curated by ChEMBL
LigandPNGBDBM50568907(CHEMBL4859988)
Affinity DataKi: >1.00E+4nM. Assay description: Displacement of [3H]N-methylspiperone from human dopamine D4 receptor incubated for 1 hr by liquid scintillation counting method
Ligand InfoPC cidPC sid
In DepthDetails ArticlePubMed