BDBM50569036 CHEMBL4870817
SMILES Cc1c(NC(=O)NNC(=O)c2ccc(cc2)S(N)(=O)=O)oc2ccccc12
InChI Key InChIKey=SWPZLABVLATEQN-UHFFFAOYSA-N
Data  4 KI
  Tab Delimited (TSV)   2D SDfile   Computed 3D by Vconf -m prep SDfile
Find this compound or compounds like it in BindingDB:
Activity Spreadsheet -- Enzyme Inhibition Constant Data from BindingDB
Found 4 hits for monomerid = 50569036
TargetCarbonic anhydrase 12(Homo sapiens (Human))
Kafrelsheikh University
Curated by ChEMBL
LigandPNGBDBM50569036(CHEMBL4870817)
Affinity DataKi:  9.60nM. Assay description: Inhibition of human CA12 by stopped- flow CO2 hydration assay
Ligand InfoPC cidPC sid
In DepthDetails ArticlePubMed
TargetCarbonic anhydrase 9(Homo sapiens (Human))
Kafrelsheikh University
Curated by ChEMBL
LigandPNGBDBM50569036(CHEMBL4870817)
Affinity DataKi:  13nM. Assay description: Inhibition of human CA9 by stopped- flow CO2 hydration assay
Ligand InfoPC cidPC sid
In DepthDetails ArticlePubMed
TargetCarbonic anhydrase 2(Homo sapiens (Human))
Kafrelsheikh University
Curated by ChEMBL
LigandPNGBDBM50569036(CHEMBL4870817)
Affinity DataKi:  28nM. Assay description: Inhibition of human CA2 by stopped- flow CO2 hydration assay
Ligand InfoPC cidPC sid
In DepthDetails ArticlePubMed
TargetCarbonic anhydrase 1(Homo sapiens (Human))
Kafrelsheikh University
Curated by ChEMBL
LigandPNGBDBM50569036(CHEMBL4870817)
Affinity DataKi:  38nM. Assay description: Inhibition of human CA1 by stopped- flow CO2 hydration assay
Ligand InfoPC cidPC sid
In DepthDetails ArticlePubMed