BDBM50569953 CHEMBL4871079
SMILES CC(C)C[C@H](N)C(=O)NS(=O)(=O)OC[C@H]1OC[C@@H](CCCn2cc(CN)nn2)[C@H](O)[C@@H]1O
InChI Key InChIKey=CBXGRYCGMRFRFP-LMLQULGWSA-N
Data  1 KI
PDB links: 1 PDB ID matches this monomer.
  Tab Delimited (TSV)   2D SDfile   Computed 3D by Vconf -m prep SDfile
Find this compound or compounds like it in BindingDB:
Activity Spreadsheet -- Enzyme Inhibition Constant Data from BindingDB
Found 1 hit for monomerid = 50569953
TargetLeucine--tRNA ligase(Escherichia coli (strain K12))
Ku Leuven
Curated by ChEMBL
LigandPNGBDBM50569953(CHEMBL4871079)
Affinity DataKi:  2.97E+3nM. Assay description: Inhibition of recombinant Escherichia coli LeuRS assessed as inhibition of 14C-radiolabelled leucine transfer to tRNA leucine preincubated for 10 min...
Ligand InfoPC cidPC sidPDB
In DepthDetails ArticlePubMed