BDBM50570889 CHEMBL4876808
SMILES CC(C)c1ccc(C)cc1OCc1cn(nn1)-c1ccccc1C
InChI Key InChIKey=VBAASMSGXDRSQM-UHFFFAOYSA-N
Data  1 IC50
  Tab Delimited (TSV)   2D SDfile   Computed 3D by Vconf -m prep SDfile
Find this compound or compounds like it in BindingDB:
Activity Spreadsheet -- Enzyme Inhibition Constant Data from BindingDB
Found 1 hit for monomerid = 50570889
TargetPolyunsaturated fatty acid lipoxygenase ALOX15B(Rattus norvegicus)
Albaha University
Curated by ChEMBL
LigandPNGBDBM50570889(CHEMBL4876808)
Affinity DataIC50:  2.21E+3nM. Assay description: Inhibition of human thymidylate synthase expressed in Escherichia coli using 6R,S-tetrahydrofolate and dUMP as substrate by spectrophotometric analys...
Ligand InfoPC cidPC sid
In DepthDetails ArticlePubMed