BDBM50571975 CHEMBL4867433
SMILES Clc1ncc(cc1NS(=O)(=O)c1ccccc1)-c1ccc2nncc(Nc3ccccc3)c2c1
InChI Key InChIKey=YCZFQFWVTGHCED-UHFFFAOYSA-N
Data  1 IC50
  Tab Delimited (TSV)   2D SDfile   Computed 3D by Vconf -m prep SDfile
Find this compound or compounds like it in BindingDB:
Activity Spreadsheet -- Enzyme Inhibition Constant Data from BindingDB
Found 1 hit for monomerid = 50571975
LigandPNGBDBM50571975(CHEMBL4867433)
Affinity DataIC50:  4.5nM. Assay description: Inhibition of PI3Kdelta (unknown origin)
Ligand InfoPC cidPC sid
In DepthDetails ArticlePubMed