BDBM50572009 CHEMBL4869122
SMILES [H][C@@]12COc3ccccc3[C@@]1([H])OCCN2CCCCNC(=O)c1ccc(cc1)[N+]([O-])=O
InChI Key InChIKey=CQNWLYUGTVHPNE-TZIWHRDSSA-N
Data  2 KI
  Tab Delimited (TSV)   2D SDfile   Computed 3D by Vconf -m prep SDfile
Find this compound or compounds like it in BindingDB:
Activity Spreadsheet -- Enzyme Inhibition Constant Data from BindingDB
Found 2 hits for monomerid = 50572009
TargetD(3) dopamine receptor(Homo sapiens)
Southeast University
Curated by ChEMBL
LigandPNGBDBM50572009(CHEMBL4869122)
Affinity DataKi:  34nM. Assay description: Displacement of [3H]spiperone from human D3 receptor transfected in HEK293 cell membrane measured after 50 mins by competitive radioligand binding an...
Ligand InfoPC cidPC sid
In DepthDetails ArticlePubMed
TargetD(2) dopamine receptor(Homo sapiens (Human))
Southeast University
Curated by ChEMBL
LigandPNGBDBM50572009(CHEMBL4869122)
Affinity DataKi:  962nM. Assay description: Displacement of [3H]spiperone from human D2 receptor transfected in HEK293 cell membrane measured after 50 mins by competitive radioligand binding an...
Ligand InfoPC cidPC sid
In DepthDetails ArticlePubMed