BDBM50572640 CHEMBL4848669
SMILES Cc1ccc(O[C@H]2CC[C@@H](CC2)C(=O)C(=O)Nc2ccc3n(C)ccc3c2)cn1
InChI Key InChIKey=AJOBXCFQAFSDKG-RUCARUNLSA-N
Data  1 EC50
  Tab Delimited (TSV)   2D SDfile   Computed 3D by Vconf -m prep SDfile
Find this compound or compounds like it in BindingDB:
Activity Spreadsheet -- Enzyme Inhibition Constant Data from BindingDB
Found 1 hit for monomerid = 50572640
TargetNeuronal acetylcholine receptor subunit alpha-7(Homo sapiens (Human))
Gedeon Richter
Curated by ChEMBL
LigandPNGBDBM50572640(CHEMBL4848669)
Affinity DataEC50:  670nM. Assay description: Positive allosteric modulator activity at human alpha7 nAChR expressed in Flp-In-HEK293 cells co-expressing RIC-3 assessed as potentiation of PNU2829...
Ligand InfoPC cidPC sid
In DepthDetails ArticlePubMed