BDBM50572651 CHEMBL4862421
SMILES Cc1ccc(CN2CCN(CC2)C(=O)C(=O)Nc2cnc3n(C)cc(F)c3c2)cc1
InChI Key InChIKey=FKYBEMRXGHLJPO-UHFFFAOYSA-N
Data  1 EC50
  Tab Delimited (TSV)   2D SDfile   Computed 3D by Vconf -m prep SDfile
Find this compound or compounds like it in BindingDB:
Activity Spreadsheet -- Enzyme Inhibition Constant Data from BindingDB
Found 1 hit for monomerid = 50572651
TargetNeuronal acetylcholine receptor subunit alpha-7(Homo sapiens (Human))
Gedeon Richter
Curated by ChEMBL
LigandPNGBDBM50572651(CHEMBL4862421)
Affinity DataEC50:  210nM. Assay description: Positive allosteric modulator activity at human alpha7 nAChR expressed in Flp-In-HEK293 cells co-expressing RIC-3 assessed as potentiation of PNU2829...
Ligand InfoPC cidPC sid
In DepthDetails ArticlePubMed