BDBM50573146 CHEMBL4879190
SMILES CN(C)Cc1ccc(cc1)-c1cnc2ccc(CN(C)c3nnc(o3)-c3ncc(cc3C)-c3c(C)nn(C)c3C)cn12
InChI Key InChIKey=CZIXXCVLEHVEBZ-UHFFFAOYSA-N
Data  4 IC50
PDB links: 1 PDB ID matches this monomer.
  Tab Delimited (TSV)   2D SDfile   Computed 3D by Vconf -m prep SDfile
Find this compound or compounds like it in BindingDB:
Activity Spreadsheet -- Enzyme Inhibition Constant Data from BindingDB
Found 4 hits for monomerid = 50573146
TargetReceptor-type tyrosine-protein kinase FLT3(Homo sapiens (Human))
Astrazeneca
Curated by ChEMBL
LigandPNGBDBM50573146(CHEMBL4879190)
Affinity DataIC50:  16nM. Assay description: Inhibition of FLAG-tagged MER (unknown origin) transfected in Cos-7cells assessed as phosphorylation level incubated for 1 hr by ELISA
In DepthDetails ArticlePubMed
TargetTyrosine-protein kinase receptor TYRO3(Homo sapiens (Human))
Astrazeneca
Curated by ChEMBL
LigandPNGBDBM50573146(CHEMBL4879190)
Affinity DataIC50: <3.16E+4nM. Assay description: Inhibition of FLAG-tagged Tyro3 (unknown origin) transfected in Cos-7 cells assessed as phosphorylation level incubated for 1 hr by ELISA
In DepthDetails ArticlePubMed
TargetReceptor-type tyrosine-protein kinase FLT3(Homo sapiens (Human))
Astrazeneca
Curated by ChEMBL
LigandPNGBDBM50573146(CHEMBL4879190)
Affinity DataIC50: <3.16E+4nM. Assay description: Inhibition of FLAG-tagged FLT3 (unknown origin) transfected in Cos-7 cells assessed as phosphorylation level incubated for 1 hr by ELISA
In DepthDetails ArticlePubMed
TargetTyrosine-protein kinase receptor UFO(Homo sapiens (Human))
Astrazeneca
Curated by ChEMBL
LigandPNGBDBM50573146(CHEMBL4879190)
Affinity DataIC50:  100nM. Assay description: Inhibition of FLAG-tagged AXL (unknown origin) transfected in Cos-7 cells assessed as phosphorylation level incubated for 1 hr by ELISA
In DepthDetails ArticlePubMed