BDBM50573198 CHEMBL4848138
SMILES CN(C)CCc1ccc(Nc2cnn(C)c(=O)c2Cl)cc1
InChI Key InChIKey=GMOXVZIZCRBKJB-UHFFFAOYSA-N
Data  1 IC50
PDB links: 1 PDB ID matches this monomer.
  Tab Delimited (TSV)   2D SDfile   Computed 3D by Vconf -m prep SDfile
Find this compound or compounds like it in BindingDB:
Activity Spreadsheet -- Enzyme Inhibition Constant Data from BindingDB
Found 1 hit for monomerid = 50573198
TargetNucleosome-remodeling factor subunit BPTF(Homo sapiens (Human))
University Of Minnesota
Curated by ChEMBL
LigandPNGBDBM50573198(CHEMBL4848138)
Affinity DataIC50:  170nM. Assay description: Inhibition of HIS9-tagged BPTF (unknown origin) expressed in Escherichia coli BL21 (DE3) cells incubated for 30 mins by AlphaScreen assay
Ligand InfoPC cidPC sidPDB