BDBM50573250 CHEMBL4874854
SMILES Fc1ccccc1-c1n[nH]cc1N1CCNCC1
InChI Key InChIKey=LCJSVVCXJQEDOV-UHFFFAOYSA-N
Data  13 KI  2 IC50
  Tab Delimited (TSV)   2D SDfile   Computed 3D by Vconf -m prep SDfile
Find this compound or compounds like it in BindingDB:
Activity Spreadsheet -- Enzyme Inhibition Constant Data from BindingDB
Found 15 hits for monomerid = 50573250
Target5-hydroxytryptamine receptor 7(Homo sapiens (Human))
Korea Institute Of Science And Technology
Curated by ChEMBL
LigandPNGBDBM50573250(CHEMBL4874854)
Affinity DataKi:  79nM. Assay description: Displacement of [3H]-LSD from 5HT7 receptor (unknown origin) transfected in HEK293 cells incubated for 1.5 hrs by liquid scintillation counting
Ligand InfoPC cidPC sid
In DepthDetails ArticlePubMed
Target5-hydroxytryptamine receptor 7(Homo sapiens (Human))
Korea Institute Of Science And Technology
Curated by ChEMBL
LigandPNGBDBM50573250(CHEMBL4874854)
Affinity DataKi:  81nM. Assay description: Displacement of [3H]-LSD from 5HT7 receptor (unknown origin) transfected in HEK293 cells incubated for 1.5 hrs by liquid scintillation counting
Ligand InfoPC cidPC sid
In DepthDetails ArticlePubMed
Target5-hydroxytryptamine receptor 1A(Homo sapiens (Human))
Korea Institute Of Science And Technology
Curated by ChEMBL
LigandPNGBDBM50573250(CHEMBL4874854)
Affinity DataKi:  469nM. Assay description: Binding affinity to 5HT1A receptor (unknown origin)
Ligand InfoPC cidPC sid
In DepthDetails ArticlePubMed
Target5-hydroxytryptamine receptor 6(Homo sapiens (Human))
Korea Institute Of Science And Technology
Curated by ChEMBL
LigandPNGBDBM50573250(CHEMBL4874854)
Affinity DataKi:  713nM. Assay description: Binding affinity to 5HT6 receptor (unknown origin)
Ligand InfoPC cidPC sid
In DepthDetails ArticlePubMed
Target5-hydroxytryptamine receptor 3A(Homo sapiens (Human))
Korea Institute Of Science And Technology
Curated by ChEMBL
LigandPNGBDBM50573250(CHEMBL4874854)
Affinity DataKi:  1.96E+3nM. Assay description: Binding affinity to 5HT3 receptor (unknown origin)
Ligand InfoPC cidPC sid
In DepthDetails ArticlePubMed
Target5-hydroxytryptamine receptor 2B(Homo sapiens (Human))
Korea Institute Of Science And Technology
Curated by ChEMBL
LigandPNGBDBM50573250(CHEMBL4874854)
Affinity DataKi:  2.13E+3nM. Assay description: Binding affinity to 5HT2B receptor (unknown origin)
Ligand InfoPC cidPC sid
In DepthDetails ArticlePubMed
Target5-hydroxytryptamine receptor 2A(Homo sapiens (Human))
Korea Institute Of Science And Technology
Curated by ChEMBL
LigandPNGBDBM50573250(CHEMBL4874854)
Affinity DataKi: >1.00E+4nM. Assay description: Binding affinity to 5HT2A receptor (unknown origin)
Ligand InfoPC cidPC sid
In DepthDetails ArticlePubMed
Target5-hydroxytryptamine receptor 1D(Homo sapiens (Human))
Korea Institute Of Science And Technology
Curated by ChEMBL
LigandPNGBDBM50573250(CHEMBL4874854)
Affinity DataKi: >1.00E+4nM. Assay description: Binding affinity to 5HT1D receptor (unknown origin)
Ligand InfoPC cidPC sid
In DepthDetails ArticlePubMed
Target5-hydroxytryptamine receptor 1B(Homo sapiens (Human))
Korea Institute Of Science And Technology
Curated by ChEMBL
LigandPNGBDBM50573250(CHEMBL4874854)
Affinity DataKi: >1.00E+4nM. Assay description: Binding affinity to 5HT1B receptor (unknown origin)
Ligand InfoPC cidPC sid
In DepthDetails ArticlePubMed
Target5-hydroxytryptamine receptor 1E(Homo sapiens (Human))
Korea Institute Of Science And Technology
Curated by ChEMBL
LigandPNGBDBM50573250(CHEMBL4874854)
Affinity DataKi: >1.00E+4nM. Assay description: Binding affinity to 5HT1E receptor (unknown origin)
Ligand InfoPC cidPC sid
In DepthDetails ArticlePubMed
Target5-hydroxytryptamine receptor 5A(Homo sapiens (Human))
Korea Institute Of Science And Technology
Curated by ChEMBL
LigandPNGBDBM50573250(CHEMBL4874854)
Affinity DataKi: >1.00E+4nM. Assay description: Binding affinity to 5HT5A receptor (unknown origin)
Ligand InfoPC cidPC sid
In DepthDetails ArticlePubMed
Target5-hydroxytryptamine receptor 2C(Homo sapiens)
Korea Institute Of Science And Technology
Curated by ChEMBL
LigandPNGBDBM50573250(CHEMBL4874854)
Affinity DataKi: >1.00E+4nM. Assay description: Binding affinity to 5HT2C receptor (unknown origin)
Ligand InfoPC cidPC sid
In DepthDetails ArticlePubMed
Target5-hydroxytryptamine receptor 4(Homo sapiens (Human))
Korea Institute Of Science And Technology
Curated by ChEMBL
LigandPNGBDBM50573250(CHEMBL4874854)
Affinity DataKi: >1.00E+4nM. Assay description: Binding affinity to 5HT4 receptor (unknown origin)
Ligand InfoPC cidPC sid
In DepthDetails ArticlePubMed
Target5-hydroxytryptamine receptor 7(Homo sapiens (Human))
Korea Institute Of Science And Technology
Curated by ChEMBL
LigandPNGBDBM50573250(CHEMBL4874854)
Affinity DataIC50:  5.47E+3nM. Assay description: Antagonist activity at human 5-HT7 receptor expressed in HEK293 cells assessed as reduction in cAMP accumulation incubated for 30 mins by microplate ...
Ligand InfoPC cidPC sid
In DepthDetails ArticlePubMed
Target5-hydroxytryptamine receptor 7(Homo sapiens (Human))
Korea Institute Of Science And Technology
Curated by ChEMBL
LigandPNGBDBM50573250(CHEMBL4874854)
Affinity DataIC50:  5.50E+3nM. Assay description: Antagonist activity at human 5-HT7 receptor expressed in HEK293 cells assessed as reduction in cAMP accumulation incubated for 30 mins by microplate ...
Ligand InfoPC cidPC sid
In DepthDetails ArticlePubMed