BDBM50575174 Mavacamten
SMILES CC(C)n1c(=O)cc(N[C@@H](C)c2ccccc2)[nH]c1=O
InChI Key InChIKey=RLCLASQCAPXVLM-NSHDSACASA-N
Data  2 EC50
PDB links: 2 PDB IDs match this monomer.
  Tab Delimited (TSV)   2D SDfile   Computed 3D by Vconf -m prep SDfile
Find this compound or compounds like it in BindingDB:
Activity Spreadsheet -- Enzyme Inhibition Constant Data from BindingDB
Found 2 hits for monomerid = 50575174
TargetCytochrome P450 2B6(Homo sapiens (Human))
Cytokinetics
Curated by ChEMBL
LigandPNGBDBM50575174(Mavacamten)
Affinity DataEC50:  5.10E+3nM. Assay description: Induction of CYP2B6 in human hepatocytes assessed as mRNA expression incubated for 3 days by RT-RTPCR analysis
In DepthDetails ArticlePubMed
TargetCytochrome P450 3A4(Homo sapiens (Human))
Cytokinetics
Curated by ChEMBL
LigandPNGBDBM50575174(Mavacamten)
Affinity DataEC50:  2.20E+3nM. Assay description: Induction of CYP3A4 in human hepatocytes assessed as mRNA expression incubated for 3 days by RT-RTPCR analysis
In DepthDetails ArticlePubMed