BDBM50575413 CHEMBL4877679
SMILES CCCc1nnc2c(Oc3ccc(NS(=O)(=O)c4cc(Cl)ccc4OC)cc3)nc3cc(F)c(F)cc3n12
InChI Key InChIKey=OARFNQIGDBYDIP-UHFFFAOYSA-N
Data  2 IC50
  Tab Delimited (TSV)   2D SDfile   Computed 3D by Vconf -m prep SDfile
Find this compound or compounds like it in BindingDB:
Activity Spreadsheet -- Enzyme Inhibition Constant Data from BindingDB
Found 2 hits for monomerid = 50575413
TargetUrea transporter 1(Rattus norvegicus (Rat))
San Francisco State University
Curated by ChEMBL
LigandPNGBDBM50575413(CHEMBL4877679)
Affinity DataIC50:  800nM. Assay description: Inhibition of rat UT-B incubated for 15 mins
Ligand InfoPC cidPC sid
In DepthDetails ArticlePubMed
TargetUrea transporter 2(Rattus norvegicus (Rat))
San Francisco State University
Curated by ChEMBL
LigandPNGBDBM50575413(CHEMBL4877679)
Affinity DataIC50:  300nM. Assay description: Inhibition of rat UT-A1 expressed in MDCK cells incubated for 15 mins by fluorescence plate reader assay
Ligand InfoPC cidPC sid
In DepthDetails ArticlePubMed