BDBM50575500 CHEMBL4866117
SMILES CCCCC(=O)\C=C\c1cccc(O)c1O
InChI Key InChIKey=YYOWSPCDQFVOGI-CMDGGOBGSA-N
Data  1 IC50
  Tab Delimited (TSV)   2D SDfile   Computed 3D by Vconf -m prep SDfile
Find this compound or compounds like it in BindingDB:
Activity Spreadsheet -- Enzyme Inhibition Constant Data from BindingDB
Found 1 hit for monomerid = 50575500
TargetIslet amyloid polypeptide(Homo sapiens)
Taipei Medical University
Curated by ChEMBL
LigandPNGBDBM50575500(CHEMBL4866117)
Affinity DataIC50:  700nM. Assay description: Inhibition of islet amyloid polypeptide (unknown origin) aggregation after 24 hrs by thioflavin T based fluorescence assay
Ligand InfoPC cidPC sid
In DepthDetails ArticlePubMed