BDBM50575507 CHEMBL4861462
SMILES CCCC(=O)CCc1cccc(O)c1O
InChI Key InChIKey=WNEQRSCYKZLZJY-UHFFFAOYSA-N
Data  1 IC50
  Tab Delimited (TSV)   2D SDfile   Computed 3D by Vconf -m prep SDfile
Find this compound or compounds like it in BindingDB:
Activity Spreadsheet -- Enzyme Inhibition Constant Data from BindingDB
Found 1 hit for monomerid = 50575507
TargetIslet amyloid polypeptide(Homo sapiens)
Taipei Medical University
Curated by ChEMBL
LigandPNGBDBM50575507(CHEMBL4861462)
Affinity DataIC50:  3.30E+3nM. Assay description: Inhibition of islet amyloid polypeptide (unknown origin) aggregation after 24 hrs by thioflavin T based fluorescence assay
Ligand InfoPC cidPC sid
In DepthDetails ArticlePubMed