BDBM50575517 CHEMBL4869463
SMILES CCOc1nc2ccc(OC)cc2n1CCNC(=O)C1CC1
InChI Key InChIKey=BIZPRFMEEMOSNC-UHFFFAOYSA-N
Data  2 KI  2 EC50
  Tab Delimited (TSV)   2D SDfile   Computed 3D by Vconf -m prep SDfile
Find this compound or compounds like it in BindingDB:
Activity Spreadsheet -- Enzyme Inhibition Constant Data from BindingDB
Found 4 hits for monomerid = 50575517
TargetMelatonin receptor type 1A(Homo sapiens (Human))
Ach�
Curated by ChEMBL
LigandPNGBDBM50575517(CHEMBL4869463)
Affinity DataKi:  0.710nM. Assay description: Displacement of 2-[1251]-iodomelatonin from human MT1 receptor expressed in CHO cells incubated for 60 mins by scintillation counting analysis
Ligand InfoPC cidPC sid
In DepthDetails ArticlePubMed
TargetMelatonin receptor type 1B(Homo sapiens (Human))
Ach�
Curated by ChEMBL
LigandPNGBDBM50575517(CHEMBL4869463)
Affinity DataKi:  3.90nM. Assay description: Displacement of 2-[1251]-iodomelatonin from human MT2 receptor expressed in CHO cells incubated for 120 mins by scintillation counting analysis
Ligand InfoPC cidPC sid
In DepthDetails ArticlePubMed
TargetMelatonin receptor type 1B(Homo sapiens (Human))
Ach�
Curated by ChEMBL
LigandPNGBDBM50575517(CHEMBL4869463)
Affinity DataEC50:  0.560nM. Assay description: Agonist activity at human MT2 receptor expressed in CHO cells assessed as increase in cAMP production incubated at 37 degreeC by fluorometric method
Ligand InfoPC cidPC sid
In DepthDetails ArticlePubMed
TargetMelatonin receptor type 1A(Homo sapiens (Human))
Ach�
Curated by ChEMBL
LigandPNGBDBM50575517(CHEMBL4869463)
Affinity DataEC50:  0.75nM. Assay description: Agonist activity at human MT1 receptor expressed in CHO cells assessed as increase in cAMP levels incubated at 28 degreeC by cellular dielectric spec...
Ligand InfoPC cidPC sid
In DepthDetails ArticlePubMed