BDBM50575637 CHEMBL4845706
SMILES COc1cc2nc(cc(NCC3CCN(CC3)c3ncc(cn3)C(=O)NO)c2cc1OC)C1CCCCC1
InChI Key InChIKey=MBCBSHBZQHGIQA-UHFFFAOYSA-N
Data  4 IC50
  Tab Delimited (TSV)   2D SDfile   Computed 3D by Vconf -m prep SDfile
Find this compound or compounds like it in BindingDB:
Activity Spreadsheet -- Enzyme Inhibition Constant Data from BindingDB
Found 4 hits for monomerid = 50575637
TargetHistone deacetylase 1(Homo sapiens (Human))
University Of Navarra
Curated by ChEMBL
LigandPNGBDBM50575637(CHEMBL4845706)
Affinity DataIC50:  2nM. Assay description: Inhibition of full length human C-terminal His-tagged/C-terminal Flag-tagged HDAC1 using fluorogenic acetylated peptide as substrate incubated for 30...
Ligand InfoPC cidPC sid
In DepthDetails ArticlePubMed
TargetDNA (cytosine-5)-methyltransferase 1(Homo sapiens (Human))
University Of Navarra
Curated by ChEMBL
LigandPNGBDBM50575637(CHEMBL4845706)
Affinity DataIC50: >10nM. Assay description: Inhibition of human DNMT1 enzyme using polydeoxy-inosine polydeoxy-cytosine DNA as substrate incubated for 15 mins in presence of SAM by TR-FRET assa...
Ligand InfoPC cidPC sid
In DepthDetails ArticlePubMed
TargetHistone-lysine N-methyltransferase EHMT2(Homo sapiens (Human))
University Of Navarra
Curated by ChEMBL
LigandPNGBDBM50575637(CHEMBL4845706)
Affinity DataIC50: >10nM. Assay description: Inhibition of human G9a enzyme using histone monomethyl-H3K9 peptide as substrate incubated for 1 hr in presence of SAM by TR-FRET assay
Ligand InfoPC cidPC sid
In DepthDetails ArticlePubMed
TargetHistone deacetylase 6(Homo sapiens (Human))
University Of Navarra
Curated by ChEMBL
LigandPNGBDBM50575637(CHEMBL4845706)
Affinity DataIC50:  111nM. Assay description: Inhibition of full length human N-terminal GST-tagged HDAC6 using fluorogenic acetylated peptide as substrate incubated for 30 mins by fluorescence p...
Ligand InfoPC cidPC sid
In DepthDetails ArticlePubMed