BDBM50575872 CHEMBL4873606
SMILES OC(=O)CCc1cc(-c2cc(Cl)cc(Cl)c2)n(n1)-c1ccccc1
InChI Key InChIKey=GNRYFELIUOQAJQ-UHFFFAOYSA-N
Data  3 EC50
  Tab Delimited (TSV)   2D SDfile   Computed 3D by Vconf -m prep SDfile
Find this compound or compounds like it in BindingDB:
Activity Spreadsheet -- Enzyme Inhibition Constant Data from BindingDB
Found 3 hits for monomerid = 50575872
TargetRetinoic acid receptor RXR-alpha(Homo sapiens (Human))
Goethe-University Frankfurt
Curated by ChEMBL
LigandPNGBDBM50575872(CHEMBL4873606)
Affinity DataEC50:  700nM. Assay description: Agonist activity at human RXRalpha transfected in human HEK293T cells co-expressing pFR/pRL-Luc incubated for 14 to 16 hrs by hybrid reporter gene as...
Ligand InfoPC cidPC sid
In DepthDetails ArticlePubMed
TargetRetinoic acid receptor RXR-gamma(Homo sapiens (Human))
Goethe-University Frankfurt
Curated by ChEMBL
LigandPNGBDBM50575872(CHEMBL4873606)
Affinity DataEC50:  1.60E+3nM. Assay description: Agonist activity at human RXRgamma transfected in human HEK293T cells co-expressing pFR/pRL-Luc incubated for 14 to 16 hrs by hybrid reporter gene as...
Ligand InfoPC cidPC sid
In DepthDetails ArticlePubMed
TargetRetinoic acid receptor RXR-beta(Homo sapiens (Human))
Goethe-University Frankfurt
Curated by ChEMBL
LigandPNGBDBM50575872(CHEMBL4873606)
Affinity DataEC50:  40nM. Assay description: Agonist activity at human RXRbeta transfected in human HEK293T cells co-expressing pFR/pRL-Luc incubated for 14 to 16 hrs by hybrid reporter gene ass...
Ligand InfoPC cidPC sid
In DepthDetails ArticlePubMed