BDBM50576171 CHEMBL4875567
SMILES [H][C@@]1(CC[C@@]2([H])[C@]3([H])[C@@H](O)C[C@]4([H])C[C@@H](CC[C@]4(C)[C@@]3([H])CC[C@]12C)NC(=O)CC[C@@H](C)[C@@]1([H])CC[C@@]2([H])[C@]3([H])[C@@H](O)C[C@]4([H])C[C@H](O)CC[C@]4(C)[C@@]3([H])CC[C@]12C)[C@H](C)CCC(=O)NCCS(O)(=O)=O
InChI Key InChIKey=GNFREIILYPOKRO-PBQTULMZSA-N
Data  1 IC50
  Tab Delimited (TSV)   2D SDfile   Computed 3D by Vconf -m prep SDfile
Find this compound or compounds like it in BindingDB:
Activity Spreadsheet -- Enzyme Inhibition Constant Data from BindingDB
Found 1 hit for monomerid = 50576171
TargetSodium/bile acid cotransporter(Homo sapiens (Human))
National Institute Of Biological Sciences
Curated by ChEMBL
LigandPNGBDBM50576171(CHEMBL4875567)
Affinity DataIC50:  0.300nM. Assay description: Inhibition of human NTCP-mediated [3H]-TCA uptake expressed in human HepG2 cells pretreated for 2 hrs followed by [3H]-TCA addition in absence of FBS
Ligand InfoPC cidPC sid
In DepthDetails ArticlePubMed