BDBM50577043 CHEMBL4879134
SMILES CCC12CC3CC(C1)CC(C3)(C2)NC(=O)c1ccc(cc1)C(F)(F)F
InChI Key InChIKey=WCVYWULSGLUOBF-UHFFFAOYSA-N
Data  1 IC50
  Tab Delimited (TSV)   2D SDfile   Computed 3D by Vconf -m prep SDfile
Find this compound or compounds like it in BindingDB:
Activity Spreadsheet -- Enzyme Inhibition Constant Data from BindingDB
Found 1 hit for monomerid = 50577043
TargetEnvelope phospholipase F13(Vaccinia virus (strain Western Reserve) (VACV) (Va...)
Samara State Technical University
Curated by ChEMBL
LigandPNGBDBM50577043(CHEMBL4879134)
Affinity DataIC50:  4.10E+3nM. Assay description: Inhibition of p37 in Vaccinia virus Copenhagen infected in African green monkey Vero cells assessed as reduction in viral reproduction incubated for ...
Ligand InfoPC cidPC sid
In DepthDetails ArticlePubMed