BDBM50577044 CHEMBL4877767
SMILES CN(C(=O)c1ccc(cc1)C(F)(F)F)C12CC3CC(CC(C3)C1)C2
InChI Key InChIKey=NNCDHNYZSIVCDP-UHFFFAOYSA-N
Data  1 IC50
  Tab Delimited (TSV)   2D SDfile   Computed 3D by Vconf -m prep SDfile
Find this compound or compounds like it in BindingDB:
Activity Spreadsheet -- Enzyme Inhibition Constant Data from BindingDB
Found 1 hit for monomerid = 50577044
TargetEnvelope phospholipase F13(Vaccinia virus (strain Western Reserve) (VACV) (Va...)
Samara State Technical University
Curated by ChEMBL
LigandPNGBDBM50577044(CHEMBL4877767)
Affinity DataIC50:  4.85E+3nM. Assay description: Inhibition of p37 in Vaccinia virus Copenhagen infected in African green monkey Vero cells assessed as reduction in viral reproduction incubated for ...
Ligand InfoPC cidPC sid
In DepthDetails ArticlePubMed