BDBM50577049 CHEMBL4850454
SMILES FC(F)(F)c1ccc(cc1)C(=O)NNC(=O)C12CC3CC(CC(C3)C1)C2
InChI Key InChIKey=PHXAPFLCZNRMNH-UHFFFAOYSA-N
Data  1 IC50
  Tab Delimited (TSV)   2D SDfile   Computed 3D by Vconf -m prep SDfile
Find this compound or compounds like it in BindingDB:
Activity Spreadsheet -- Enzyme Inhibition Constant Data from BindingDB
Found 1 hit for monomerid = 50577049
TargetEnvelope phospholipase F13(Vaccinia virus (strain Western Reserve) (VACV) (Va...)
Samara State Technical University
Curated by ChEMBL
LigandPNGBDBM50577049(CHEMBL4850454)
Affinity DataIC50:  1.07E+3nM. Assay description: Inhibition of p37 in Vaccinia virus Copenhagen infected in African green monkey Vero cells assessed as reduction in viral reproduction incubated for ...
Ligand InfoPC cidPC sid
In DepthDetails ArticlePubMed