BDBM50577510 CHEMBL4858970
SMILES COc1nc(ccc1-n1cnc(C)c1)C1=NOCC(N1)c1ccc(Cl)c(c1)C1CC1
InChI Key InChIKey=HZYVDSNNYUIAJT-UHFFFAOYSA-N
Data  1 EC50
  Tab Delimited (TSV)   2D SDfile   Computed 3D by Vconf -m prep SDfile
Find this compound or compounds like it in BindingDB:
Activity Spreadsheet -- Enzyme Inhibition Constant Data from BindingDB
Found 1 hit for monomerid = 50577510
TargetPresenilin-1(Homo sapiens (Human))
Forum Pharmaceuticals
Curated by ChEMBL
LigandPNGBDBM50577510(CHEMBL4858970)
Affinity DataEC50:  13nM. Assay description: Modulation of gamma-secretase in human H4 cells expressing human wild type APP751 assessed as reduction in amyloid beta42 level incubated overnight b...
Ligand InfoPC cidPC sid
In DepthDetails ArticlePubMed