BDBM50577674 CHEMBL4871499
SMILES Fc1ccc2c(n[nH]c2c1)-c1cccc(c1)S(=O)(=O)Nc1cccnc1
InChI Key InChIKey=DCBQXVYNGIEOCM-UHFFFAOYSA-N
Data  1 IC50
  Tab Delimited (TSV)   2D SDfile   Computed 3D by Vconf -m prep SDfile
Find this compound or compounds like it in BindingDB:
Activity Spreadsheet -- Enzyme Inhibition Constant Data from BindingDB
Found 1 hit for monomerid = 50577674
TargetDual specificity mitogen-activated protein kinase kinase 4(Homo sapiens (Human))
Northwestern University
Curated by ChEMBL
LigandPNGBDBM50577674(CHEMBL4871499)
Affinity DataIC50:  450nM. Assay description: Inhibition of human recombinant full length N-terminal GST tagged MEK4 expressed in Sf21 cells using p38 alpha as substrate pre-incubated for 30 mins...
Ligand InfoPC cidPC sid
In DepthDetails ArticlePubMed