BDBM50578552 CHEMBL4853473
SMILES CNCCC(Oc1ccc(Br)c(F)c1)c1ccccc1
InChI Key InChIKey=JDMXMWUEDLEMIB-UHFFFAOYSA-N
Data  1 KI
  Tab Delimited (TSV)   2D SDfile   Computed 3D by Vconf -m prep SDfile
Find this compound or compounds like it in BindingDB:
Activity Spreadsheet -- Enzyme Inhibition Constant Data from BindingDB
Found 1 hit for monomerid = 50578552
TargetSodium-dependent serotonin transporter(Homo sapiens (Human))
Polish Academy Of Sciences
Curated by ChEMBL
LigandPNGBDBM50578552(CHEMBL4853473)
Affinity DataKi:  19nM. Assay description: Displacement of [3H]citalopram from human SERT in HEK293 cells by Topcount scintillation analysis
Ligand InfoPC cidPC sid
In DepthDetails ArticlePubMed