BDBM50578845 CHEMBL4860348
SMILES Cc1cc(-c2nc3c(Cl)cc(OCCNC(=O)OC(C)(C)C)cc3s2)c2ncn(C)c(=O)c2c1
InChI Key InChIKey=MXBHINMXOXIVPP-UHFFFAOYSA-N
Data  1 IC50
  Tab Delimited (TSV)   2D SDfile   Computed 3D by Vconf -m prep SDfile
Find this compound or compounds like it in BindingDB:
Activity Spreadsheet -- Enzyme Inhibition Constant Data from BindingDB
Found 1 hit for monomerid = 50578845
TargetProteinase-activated receptor 4(Mus musculus)
China Pharmaceutical University
Curated by ChEMBL
LigandPNGBDBM50578845(CHEMBL4860348)
Affinity DataIC50:  2.07E+3nM. Assay description: Antagonist activity at PAR4 in ICR mouse platelet-rich plasma assessed as inhibition of PAR4 AP AYPGKF-NH2-induced platelet aggregation by photo-turb...
Ligand InfoPC cidPC sid
In DepthDetails ArticlePubMed