BDBM50579329 CHEMBL4863218
SMILES Clc1ccc(CNCCNCCOc2cccc3n(ccc23)S(=O)(=O)c2ccccc2)cc1
InChI Key InChIKey=VTDZXMJYBRQYER-UHFFFAOYSA-N
Data  1 KI  1 IC50
  Tab Delimited (TSV)   2D SDfile   Computed 3D by Vconf -m prep SDfile
Find this compound or compounds like it in BindingDB:
Activity Spreadsheet -- Enzyme Inhibition Constant Data from BindingDB
Found 2 hits for monomerid = 50579329
Target5-hydroxytryptamine receptor 6(Homo sapiens (Human))
Jagiellonian University Medical College
Curated by ChEMBL
LigandPNGBDBM50579329(CHEMBL4863218)
Affinity DataKi:  1nM. Assay description: Displacement of [3H]-LSD from human 5HT6R expressed in CHO-K1 cell membranes incubated for 1 hr by scintillation counter method
Ligand InfoPC cidPC sid
In DepthDetails ArticlePubMed
TargetCholinesterase(Equus caballus (Horse))
Jagiellonian University Medical College
Curated by ChEMBL
LigandPNGBDBM50579329(CHEMBL4863218)
Affinity DataIC50:  1.99E+3nM. Assay description: Inhibition of equine serum BuChE using butyrylthiocholine as substrate incubated for 5 mins followed by substrate addition and measured after 5 mins ...
Ligand InfoPC cidPC sid
In DepthDetails ArticlePubMed