BDBM50579443 CHEMBL4848599
SMILES Cc1cnccc1-c1cc2c3nc(CNC(=O)c4ccc(c(c4)C(O)=O)-c4c5ccc(O)cc5oc5cc(=O)ccc45)nn3c(=O)[nH]c2cc1Cl
InChI Key InChIKey=OEIVDMIUXUREQM-UHFFFAOYSA-N
Data  1 Kd
  Tab Delimited (TSV)   2D SDfile   Computed 3D by Vconf -m prep SDfile
Find this compound or compounds like it in BindingDB:
Activity Spreadsheet -- Enzyme Inhibition Constant Data from BindingDB
Found 1 hit for monomerid = 50579443
TargetHepatitis A virus cellular receptor 2(Homo sapiens)
Vanderbilt University School Of Medicine
Curated by ChEMBL
LigandPNGBDBM50579443(CHEMBL4848599)
Affinity DataKd:  2.00E+3nM. Assay description: Binding affinity to human TIM-3 IgV domain (residues 22 to 130) expressed in Escherichia coli BL21 (DE3) by 1H-15N SOFAST-HMQC spectroscopic analysis
Ligand InfoPC cidPC sid
In DepthDetails ArticlePubMed