BDBM50579457 CHEMBL4846481
SMILES Cc1nc2c3cc(c(Cl)cc3[nH]c(=O)n2n1)-c1ccc(NS(C)(=O)=O)cc1F
InChI Key InChIKey=XLECQZJAABMWBT-UHFFFAOYSA-N
Data  1 KI
  Tab Delimited (TSV)   2D SDfile   Computed 3D by Vconf -m prep SDfile
Find this compound or compounds like it in BindingDB:
Activity Spreadsheet -- Enzyme Inhibition Constant Data from BindingDB
Found 1 hit for monomerid = 50579457
TargetHepatitis A virus cellular receptor 2(Homo sapiens)
Vanderbilt University School Of Medicine
Curated by ChEMBL
LigandPNGBDBM50579457(CHEMBL4846481)
Affinity DataKi:  287nM. Assay description: Displacement of FITC-labelled SP2 probe from human TIM-3 IgV domain (residues 22 to 130) expressed in Escherichia coli BL21 (DE3) by FPA competition ...
Ligand InfoPC cidPC sid
In DepthDetails ArticlePubMed