BDBM50579936 CHEMBL5075881
SMILES Fc1ccc(cc1)-c1cc(nc(OCC=C)c1C#N)-c1ccccn1
InChI Key InChIKey=NFTNFCQPOHTZDP-UHFFFAOYSA-N
Data  1 IC50
  Tab Delimited (TSV)   2D SDfile   Computed 3D by Vconf -m prep SDfile
Find this compound or compounds like it in BindingDB:
Activity Spreadsheet -- Enzyme Inhibition Constant Data from BindingDB
Found 1 hit for monomerid = 50579936
TargetSulfide:quinone oxidoreductase, mitochondrial(Homo sapiens)
Fox Chase Chemical Diversity Center
Curated by ChEMBL
LigandPNGBDBM50579936(CHEMBL5075881)
Affinity DataIC50:  5.5nM. Assay description: Inhibition of human SQOR
Ligand InfoPC cidPC sid
In DepthDetails ArticlePubMed