BDBM50579943 CHEMBL5077205
SMILES CCSc1nc(cc(-c2ccccc2)c1C#N)-c1ccccc1
InChI Key InChIKey=XEBKYIOVXUVZJE-UHFFFAOYSA-N
Data  1 IC50
  Tab Delimited (TSV)   2D SDfile   Computed 3D by Vconf -m prep SDfile
Find this compound or compounds like it in BindingDB:
Activity Spreadsheet -- Enzyme Inhibition Constant Data from BindingDB
Found 1 hit for monomerid = 50579943
TargetSulfide:quinone oxidoreductase, mitochondrial(Homo sapiens)
Fox Chase Chemical Diversity Center
Curated by ChEMBL
LigandPNGBDBM50579943(CHEMBL5077205)
Affinity DataIC50:  132nM. Assay description: Inhibition of human SQOR
Ligand InfoPC cidPC sid
In DepthDetails ArticlePubMed