BDBM50580242 CHEMBL1589861
SMILES Cc1ccccc1-c1ccc(s1)C(O)=O
InChI Key InChIKey=BSOIGQKKGJNDJD-UHFFFAOYSA-N
Data  1 IC50  1 Kd
PDB links: 1 PDB ID matches this monomer.
  Tab Delimited (TSV)   2D SDfile   Computed 3D by Vconf -m prep SDfile
Find this compound or compounds like it in BindingDB:
Activity Spreadsheet -- Enzyme Inhibition Constant Data from BindingDB
Found 2 hits for monomerid = 50580242
TargetRicin(Ricinus communis)
The State University Of New Jersey
Curated by ChEMBL
LigandPNGBDBM50580242(CHEMBL1589861)
Affinity DataIC50:  1.90E+4nM. Assay description: Inhibition of castor beans ricin toxin A subunit assessed as depurination of ribosome using yeast ribosomes by qRT-PCR analysis
Ligand InfoPC cidPC sidPDB
TargetRicin(Ricinus communis)
The State University Of New Jersey
Curated by ChEMBL
LigandPNGBDBM50580242(CHEMBL1589861)
Affinity DataKd:  3.72E+5nM. Assay description: Binding affinity to castor beans ricin toxin A subunit assessed as dissociation constant by surface plasmon resonance analysis
Ligand InfoPC cidPC sidPDB