BDBM50580793 CHEMBL5079941
SMILES CC(C)(Oc1ccc(COc2ccc(cc2)\N=N/c2ccccc2)cc1)C(O)=O
InChI Key InChIKey=GAKQARXXOLKBGC-IZHYLOQSSA-N
Data  3 EC50
  Tab Delimited (TSV)   2D SDfile   Computed 3D by Vconf -m prep SDfile
Find this compound or compounds like it in BindingDB:
Activity Spreadsheet -- Enzyme Inhibition Constant Data from BindingDB
Found 3 hits for monomerid = 50580793
TargetPeroxisome proliferator-activated receptor delta(Homo sapiens (Human))
Goethe-University Frankfurt
Curated by ChEMBL
LigandPNGBDBM50580793(CHEMBL5079941)
Affinity DataEC50:  4.10E+3nM. Assay description: Agonist activity at Gal4-fused human PPARdelta LBD transfected in HEK293T cells assessed as transcriptional activation incubated for 14 to 16 hrs by ...
Ligand InfoPC cidPC sid
In DepthDetails ArticlePubMed
TargetPeroxisome proliferator-activated receptor alpha(Homo sapiens (Human))
Goethe-University Frankfurt
Curated by ChEMBL
LigandPNGBDBM50580793(CHEMBL5079941)
Affinity DataEC50:  3.50E+3nM. Assay description: Agonist activity at Gal4-fused human PPARalpha LBD transfected in HEK293T cells assessed as transcriptional activation incubated for 14 to 16 hrs by ...
Ligand InfoPC cidPC sid
In DepthDetails ArticlePubMed
TargetPeroxisome proliferator-activated receptor gamma(Homo sapiens (Human))
Goethe-University Frankfurt
Curated by ChEMBL
LigandPNGBDBM50580793(CHEMBL5079941)
Affinity DataEC50:  6.60E+3nM. Assay description: Agonist activity at Gal4-fused human PPARgamma LBD transfected in HEK293T cells assessed as transcriptional activation incubated for 14 to 16 hrs by ...
Ligand InfoPC cidPC sid
In DepthDetails ArticlePubMed