BDBM50580799 CHEMBL5077172
SMILES Cc1cc(ccc1OCCc1ccc(OC(C)(C)C(O)=O)cc1)\N=N\c1ccccc1
InChI Key InChIKey=YMTMRPQOYKGHHI-CYYJNZCTSA-N
Data  3 EC50
  Tab Delimited (TSV)   2D SDfile   Computed 3D by Vconf -m prep SDfile
Find this compound or compounds like it in BindingDB:
Activity Spreadsheet -- Enzyme Inhibition Constant Data from BindingDB
Found 3 hits for monomerid = 50580799
TargetPeroxisome proliferator-activated receptor delta(Homo sapiens (Human))
Goethe-University Frankfurt
Curated by ChEMBL
LigandPNGBDBM50580799(CHEMBL5077172)
Affinity DataEC50:  540nM. Assay description: Agonist activity at Gal4-fused human PPARdelta LBD transfected in HEK293T cells assessed as transcriptional activation incubated for 14 to 16 hrs by ...
Ligand InfoPC cidPC sid
In DepthDetails ArticlePubMed
TargetPeroxisome proliferator-activated receptor alpha(Homo sapiens (Human))
Goethe-University Frankfurt
Curated by ChEMBL
LigandPNGBDBM50580799(CHEMBL5077172)
Affinity DataEC50:  7nM. Assay description: Agonist activity at Gal4-fused human PPARalpha LBD transfected in HEK293T cells assessed as transcriptional activation incubated for 14 to 16 hrs by ...
Ligand InfoPC cidPC sid
In DepthDetails ArticlePubMed
TargetPeroxisome proliferator-activated receptor gamma(Homo sapiens (Human))
Goethe-University Frankfurt
Curated by ChEMBL
LigandPNGBDBM50580799(CHEMBL5077172)
Affinity DataEC50:  1.20E+3nM. Assay description: Agonist activity at Gal4-fused human PPARgamma LBD transfected in HEK293T cells assessed as transcriptional activation incubated for 14 to 16 hrs by ...
Ligand InfoPC cidPC sid
In DepthDetails ArticlePubMed