BDBM50580808 CHEMBL5090355
SMILES Cc1ccc(cc1)\N=N/c1ccc(OCCc2ccc(OC(C)(C)C(O)=O)cc2)c(c1)C(F)(F)F
InChI Key InChIKey=PFZPYODVSDTRAU-KTMFPKCZSA-N
Data  3 EC50
  Tab Delimited (TSV)   2D SDfile   Computed 3D by Vconf -m prep SDfile
Find this compound or compounds like it in BindingDB:
Activity Spreadsheet -- Enzyme Inhibition Constant Data from BindingDB
Found 3 hits for monomerid = 50580808
TargetPeroxisome proliferator-activated receptor delta(Homo sapiens (Human))
Goethe-University Frankfurt
Curated by ChEMBL
LigandPNGBDBM50580808(CHEMBL5090355)
Affinity DataEC50:  410nM. Assay description: Agonist activity at Gal4-fused human PPARdelta LBD transfected in HEK293T cells assessed as transcriptional activation incubated for 14 to 16 hrs by ...
Ligand InfoPC cidPC sid
In DepthDetails ArticlePubMed
TargetPeroxisome proliferator-activated receptor alpha(Homo sapiens (Human))
Goethe-University Frankfurt
Curated by ChEMBL
LigandPNGBDBM50580808(CHEMBL5090355)
Affinity DataEC50:  190nM. Assay description: Agonist activity at Gal4-fused human PPARalpha LBD transfected in HEK293T cells assessed as transcriptional activation incubated for 14 to 16 hrs by ...
Ligand InfoPC cidPC sid
In DepthDetails ArticlePubMed
TargetPeroxisome proliferator-activated receptor gamma(Homo sapiens (Human))
Goethe-University Frankfurt
Curated by ChEMBL
LigandPNGBDBM50580808(CHEMBL5090355)
Affinity DataEC50:  1.30E+3nM. Assay description: Agonist activity at Gal4-fused human PPARgamma LBD transfected in HEK293T cells assessed as transcriptional activation incubated for 14 to 16 hrs by ...
Ligand InfoPC cidPC sid
In DepthDetails ArticlePubMed