BDBM50580911 CHEMBL5075260
SMILES [O-][N+](=O)c1ccc(o1)C(=O)Nc1ccc(NS(=O)(=O)c2cccc(Cl)c2)cc1
InChI Key InChIKey=QYKZTRNPYFHNAG-UHFFFAOYSA-N
Data  2 IC50
  Tab Delimited (TSV)   2D SDfile   Computed 3D by Vconf -m prep SDfile
Find this compound or compounds like it in BindingDB:
Activity Spreadsheet -- Enzyme Inhibition Constant Data from BindingDB
Found 2 hits for monomerid = 50580911
TargetUrea transporter 1(Mus musculus)
Peking University
Curated by ChEMBL
LigandPNGBDBM50580911(CHEMBL5075260)
Affinity DataIC50:  1.01E+3nM. Assay description: Inhibition of mouse UT-B expressed in MDCK cells
Ligand InfoPC cidPC sid
In DepthDetails ArticlePubMed
TargetUrea transporter 1(Rattus norvegicus (Rat))
Peking University
Curated by ChEMBL
LigandPNGBDBM50580911(CHEMBL5075260)
Affinity DataIC50:  750nM. Assay description: Inhibition of rat UT-B expressed in MDCK cells
Ligand InfoPC cidPC sid
In DepthDetails ArticlePubMed