BDBM50581181 CHEMBL5086895
SMILES [O-][n+]1cc(Cl)c(C[C@H](OC(=O)c2cccc(CNC(C(=O)O[C@H]3CN4CCC3CC4)c3ccccc3)c2)c2ccc(OC(F)F)c(OCC3CC3)c2)c(Cl)c1
InChI Key InChIKey=DKSKKVAOIPURFT-DNHBMKCVSA-N
Data  1 KI  1 IC50
  Tab Delimited (TSV)   2D SDfile   Computed 3D by Vconf -m prep SDfile
Find this compound or compounds like it in BindingDB:
Activity Spreadsheet -- Enzyme Inhibition Constant Data from BindingDB
Found 2 hits for monomerid = 50581181
TargetMuscarinic acetylcholine receptor M3(Homo sapiens (Human))
Chiesi Farmaceutici
Curated by ChEMBL
LigandPNGBDBM50581181(CHEMBL5086895)
Affinity DataKi:  0.631nM. Assay description: Displacement of [3H]-N-methyl Scopolamine Chloride from human M3 receptor membranes incubated for 2 hrs by scintillation counting analysis
Ligand InfoPC cidPC sid
In DepthDetails ArticlePubMed
TargetRetinal rod rhodopsin-sensitive cGMP 3',5'-cyclic phosphodiesterase subunit delta(Homo sapiens (Human))
Chiesi Farmaceutici
Curated by ChEMBL
LigandPNGBDBM50581181(CHEMBL5086895)
Affinity DataIC50:  0.316nM. Assay description: Inhibition of PDE4 in human U-937 cells assessed as reduction in cAMP level by LANCE cAMP Assay
Ligand InfoPC cidPC sid
In DepthDetails ArticlePubMed