BDBM50581186 CHEMBL5088742
SMILES COc1ccc(cc1OC)[C@H](Cc1c(Cl)c[n+]([O-])cc1Cl)OC(=O)c1cccc(CN(C(=O)O[C@H]2CN3CCC2CC3)c2ccccc2)c1
InChI Key InChIKey=BPBDCOLBZYWXHD-LRHLLKFHSA-N
Data  1 KI  2 IC50
  Tab Delimited (TSV)   2D SDfile   Computed 3D by Vconf -m prep SDfile
Find this compound or compounds like it in BindingDB:
Activity Spreadsheet -- Enzyme Inhibition Constant Data from BindingDB
Found 3 hits for monomerid = 50581186
TargetMuscarinic acetylcholine receptor M3(Homo sapiens (Human))
Chiesi Farmaceutici
Curated by ChEMBL
LigandPNGBDBM50581186(CHEMBL5088742)
Affinity DataKi:  0.316nM. Assay description: Displacement of [3H]-N-methyl Scopolamine Chloride from human M3 receptor membranes incubated for 2 hrs by scintillation counting analysis
Ligand InfoPC cidPC sid
In DepthDetails ArticlePubMed
TargetRetinal rod rhodopsin-sensitive cGMP 3',5'-cyclic phosphodiesterase subunit delta(Homo sapiens (Human))
Chiesi Farmaceutici
Curated by ChEMBL
LigandPNGBDBM50581186(CHEMBL5088742)
Affinity DataIC50:  1nM. Assay description: Inhibition of PDE4 in human U-937 cells assessed as reduction in cAMP level by LANCE cAMP Assay
Ligand InfoPC cidPC sid
In DepthDetails ArticlePubMed
TargetcAMP-specific 3',5'-cyclic phosphodiesterase 4B(Homo sapiens (Human))
Chiesi Farmaceutici
Curated by ChEMBL
LigandPNGBDBM50581186(CHEMBL5088742)
Affinity DataIC50:  6.30nM. Assay description: Inhibition of human recombinant PDE4B2 assessed as reduction in cAMP level incubated for 2 hrs by LANCE Ultra cAMP TR-FRET assay
Ligand InfoPC cidPC sid
In DepthDetails ArticlePubMed